BDBM32496 aryl piperidine, 9l
SMILES COc1ccc(o1)C(=O)Nc1cccc(C)c1N1CCC2(CC1)OCCO2
InChI Key InChIKey=VMQZTUVADKYPAR-UHFFFAOYSA-N
Data  2 IC50
  Tab Delimited (TSV)   2D SDfile   Computed 3D by Vconf -m prep SDfile
Find this compound or compounds like it in BindingDB:
Activity Spreadsheet -- Enzyme Inhibition Constant Data from BindingDB
Found 1 hit for monomerid = 32496
TargetIsoform Alpha-1 of Mitogen-activated protein kinase 10 (Alpha-1) 9-402](Homo sapiens (Human))
The Scripps Research Institute
LigandPNGBDBM32496(aryl piperidine, 9l)
Affinity DataIC50:  620nM. Assay description: Biochemical IC50s for JNK were determined using HTRF. In each assay the phosphor-Thr71-ATF-2 product was detected using a Europium-cryptate labeled a...
In DepthDetails ArticlePubMed